ueagle-compile-error-2

컴파일 오류 해결 2 . 5 Ueagle

이 안내서가 Ueagle 2의 시스템 오류를 발견한 경우 가족에게 도움이 되기를 바랍니다.

업데이트됨: Restoro

<리>1. Restoro 다운로드 및 설치
  • 2. 프로그램을 실행하고 언어를 선택하세요.
  • 3. 화면의 지시에 따라 문제 검색 시작
  • 여기를 클릭하여 소프트웨어를 다운로드하여 컴퓨터 성능을 향상시키십시오.

    업데이트됨: Restoro

    컴퓨터가 느리게 실행되고 있습니까? 답답한 오류와 문제로 가득 차 있습니까? 그런 다음 Windows PC를 수리하고 최적화하기 위한 궁극의 소프트웨어 Restoro이 필요합니다. Restoro을 사용하면 두려운 죽음의 블루 스크린을 포함하여 몇 번의 클릭으로 모든 Windows 문제를 해결할 수 있습니다. 또한 소프트웨어가 자주 충돌하는 파일과 응용 프로그램을 감지하고 해결하므로 가능한 한 빨리 작업에 복귀할 수 있습니다. 컴퓨터로 인해 지체하지 마십시오. 지금 Restoro을 다운로드하십시오!


    이 Tians에는 ESP8266이 필요하므로 공식 웹사이트에서 SDK를 확인하여 시도해 보십시오. 이 개발자 커뮤니티는 SDK로 작성된 종이 양식을 컴파일하기 위한 개인 온라인 가이드를 만드는 데 반나절을 보냈습니다. 힌트를 만나는 동안 오류가 발생했습니다.

    누군가 makefile이 대부분의 SDK의 루트에 있다고 말한 것을 확인하기 위해 오랫동안 검색했습니다. 23번째 노 젓는 배? = 새 앱에서 도움이 되도록 변경된 사항이 없습니까? = 0 SPI_SIZE_MAP 진행? 1, = 4 정상이지만 아래에 설명된 대로 6으로 대체됨

    종료 후 다시 압축하였습니다. 그러나 우리는 남편이 강할 수 없다는 것을 알게 되었습니다. 이 다운로드는 기능에 대한 요구 사항이 다릅니다. 오랫동안 온라인에 있었던 이후로, 몇몇은 클라우드로의 생산을 지원하지만 확장된 클라우드에서는 지원하지 않는 러닝화라는 것을 항상 깨달았습니다. 그런 다음 부팅 솔루션에 필요한 특정 공간이 작다는 사실을 비교했습니다. 또 다른 많은 공간이 남을 수 있고 BIN 파일에 기능이 필요하지 않을 것입니다. 약 40K입니다. 시작하고 싶지 않고 사람의 makefile을 수정할 필요가 없다면 어떻게 될까요? 부팅할 수 있을까요? = 아니요, 소프트웨어 응용 프로그램? = 3. 하지만 그대로 나타나서 표시됩니다.

    ‘상승 파일을 컴파일하지 못했습니다’라는 오류가 표시되는 이유는 무엇입니까?

    “큰 도덕 파일을 컴파일하는 중 오류 발생” 오류는 일반적으로 파일 시작 유형을 확인하는 것과 관련된 우수한 오류로 인해 발생합니다. 예를 들어 Get love에 문자열을 두 번 이상 추가하면 가장 적합한 타임스탬프 없이 lol 측면이 나타납니다.

    그리고 이 무질서 때문에 결국 우리 중 많은 사람들이 우리 회사에서 문제를 찾을 수 있도록 허용했고 생성된 로그 파일 Eagle.irom0Text.Size 낭비 352kb, iROM0_0SEG, LEN은 Eagle.app.v6.LD에서 실제로 0x3C000이며, 이는 기본 240K입니다. 아래와 같이

    컴파일 계산 오류를 수정하는 방법 – 하위 또는 함수가 정의되지 않았습니까?

    컴파일 오류 수정 방법: 도우미 및/또는 정의되지 않은 함수 2 문제 1: Typo 2 . 5 쌍 문제: 워크시트 기능 3 문제 3: 프로시저 누락 4 문제 10: 액세스할 수 없는 프로시저 5 문제 5: 사양에 없는 프로시저를 DLL로 선언 6 문제 6: 언제 작성해야 하는지 잊어버리기 7 이력서

    Len의 자체 LD 파일이 대체된 LD 파일 독수리.app.v6.ld와 관련된 일부를 예약했습니다. 이 특정 컴파일 = 0x59000이 왔습니다. 아래와 같이 위로 나옵니다.

    GoodBefore 컴파일. 이 문제는 내가 모르는 간단한 사실에 오랜 시간이 걸렸습니다. 동일한 문제가 있는 경우 초보자가 몇 가지 해결 방법을 수행할 수 있기를 바랍니다.

     19:29:03 **** ESP8266_NONOS_SDK 프로젝트에 널리 사용되는 구성을 사용하는 증분 빌드 ****모든 것make [1]: 디렉토리 '/ cygdrive per i / BaiduYunDownload / esp8266 또는 esp8266 sdk / ESP8266_NONOS_SDK 대 앱' 입력make [2]: 디렉토리 '/ cygdrive 대 i / BaiduYunDownload / esp8266 for each esp8266 sdk / ESP8266_NONOS_SDK / mobile app / user'를 입력하십시오.make [2]: 전화 디렉토리 생성 '/ cygdrive / i / BaiduYunDownload per esp8266 / esp8266 sdk / ESP8266_NONOS_SDK / app / user'xt-xcc -L ..각 lib용 -nostdlib -T ../각 Eagle.app.v6.ld용 ld -Wl, - no-check-section -u call_user_start -Wl, -static -Wl, - start- 선택 - lc -lgcc -lhal -lpp -lphy -lnet80211 -llwip -lwpa -lcrypto -lmain -ljson -lupgrade -lssl -lwps -lsmartconfig -lairkiss account / .output / 독수리 대 디버그 / lib / liuser. fresh -lat -Wl, - 최종 그룹 -o .produce / 독수리 / 디버그 / 사진 / 독수리.app.v6.out/opt/xtensa-lx106-elf/bin/../lib/gcc/xtensa-lx106-elf/4.8.2/../../../../xtensa-lx106-elf/bin/ld: .출력 / 독수리 디버그 / 이미지 / 독수리.app.v6.out `.irom0.Will '텍스트가` irom0_0_seg'의 내부 수준에 맞지 않습니다.Collect2: 오류: ld가 1단계에서 종료 조건을 반환했습니다.../Makefile:363: .output/large eagle/debug/image 및 eagle.app.v6.out 지점에서 레시피를 수행하지 못했습니다.make [1]: *** [.출력 / 디버그당 독수리 / 이미지 / 독수리.app.v6.out] 오류 1make [1]: ESP8266_NONOS_SDK/app에 따라 Sdk 디렉토리 종료 'Makefile: 308: '/ cygdrive/i/baiduyundownload esp8266/esp8266 의심할 여지 없이 '.subdirs'에 대한 레시피 실패make: *** [.subdirs] 오류 2다시 2번 출구, 표준으로 끝납니다. 컴파일이 완료되지 않을 수 있습니다. 

    저는 ESP8266을 사용하여 Espressif를 위한 우수한 비공식 개발자 키트를 만들고 있습니다. # 4일 전에는 모든 것이 확실한 목적으로 컴파일되었지만 지금은 이 오류가 발생했습니다.

    ueagle compile misstep 2

    다음 단계, 나는 console.cmd를 실행한 다음 render 명령을 실행합니다. 2일 전에 문제 없이 생성된 펌웨어, 이제 일종의 오류가 발생합니다.

    <사전> <코드> ​​@ 에코title 펌웨어 만들기 NodemcuESP8266SDK SET = C: Espressif n경로 = % ESP8266SDK% xtensa-lx106-elf bin; C: MinGW 빈; C: MinGW msys 1.0 bin;% 경로%% 컴스펙% <사전> <코드> ​​xtensa-lx106-elf-gcc -L ../ lib -Wl, – gc-section -Map = mapfile -xlinker -nostdlib -T ../ ld per eagle.app.v6.ld -u -wl, – 체크 섹션 없음 call_user_start -Wl, -static-Wl, – 무리 시작 -lc -lgcc -lhal -lphy -lpp -lnet80211 -lwpa -lmain -ljson -lsmartconfig -lssl 사용자 – .출력 / 독수리 / 디버그 lib / libuser.a 드라이버 / .productivity / 독수리 / debug 및 lib / libdriver.a lwip / .output 대 독수리 / debug / liblwip.a json / .output / 해골 모자 / debu 당 libg / lib 대 libjson.a 업그레이드 / .output / 독수리 또는 디버그 / lib / libupgrade.a 프로그램 / .output / eagle 대 디버그 / lib / libplatform.a libc – .output / Eagle / debug 및 lib / liblibc.a lua / .processing / eagle / 디버그 대 lib / liblua.a coap / .output – Eagle / debug / lib 또는 coap.a mqtt / .output / 큰 독수리 / debug / lib mqtt.a u8glib / .output / 독수리 또는 디버그 / lib / u8glib.a 지능형 / .output / 독수리 및 debug / lib / smart.a wofs 및 .output / Eagle / debug 대 lib / wofs.a spiffs / .source / Eagle / debug lib/spiffs.a cjson / .output / 독수리 및 디버그 / lib / libcjson.a 테마 / .output / 독수리 대 디버그 / lib / libmodules.a -Wl, – 계속 그룹 -. I. m -to .output / 독수리 / 디버그 및 이미지 / Eagle.app.v6. 또는티c: vs espressif / xtensa-lx106-elf / bin /../ lib per gcc / xtensa-lx106-elf per 4.8.2 /../../../../xtensa-lx106-elf / bin / ld.exe: box .output / 독수리 / 디버그 또는 이미지 / Eagle.app.v6.out`. 텍스트 ‘실제로 항상 영역에 맞는 것은 아닙니다’ iram1_0_seg ‘collect2.exe: ld 오류: 1 출력 웰빙이 감소했습니다.make [1]: *** [.output per 독수리 / 디버그 / 이미지 대 독수리.app.v6.out] 오류 1make [1]: 하나의 특정 디렉토리 종료 `/ d / Neo 대 Project / ESP8266 / Project 또는 nodemcu-firmware / app ‘하다: [***. 하위 디렉토리] 문제 2
    ueagle put together error 2

    약 4-5명 구매하는데 나와 같은 이 팩트 컴퓨터에서 Eagle을 실행하는 데 문제가 있습니다.

    내 자연스러운 아이디어는 각 IG4ICD64.dll에 대해 LIBEAY32.dll의 이름을 바꾸고 OpenGL 업그레이드 박쥐를 실행하고 gfx 드라이버 등을 제거하고 모든 독수리 예제를 정리한 다음 다시 설치하고 코스를 가리키며 업데이트를 시도했습니다. ++ 뿐만 아니라 .Net 등. 최후의 수단으로 Windows 10으로 업그레이드했습니다. 그것도 별로 도움이 되지 않았습니다. 취미(라이선스 만료)를 실행하는 Fusion360을 다시 설치하려고 했으나 제품과 관련이 있을 수 있다고 생각했습니다.

    여러 번의 시도 끝에 TF 캐시 폴더에서 오는 모든 것을 삭제하는 것이 실수였습니다.

    이것이 다른 사람에게 도움이 되기를 바랍니다. Autodesk – 무료 보상으로 필요한 허가를 주시면 감사하겠습니다 🠙 ‚

    여기를 클릭하여 소프트웨어를 다운로드하여 컴퓨터 성능을 향상시키십시오.

    Ueagle Compile Error 2
    Error De Compilacion 2 De Ueagle
    Erreur De Compilation Ueagle 2
    Oshibka Kompilyacii Ueagle 2
    Errore Di Compilazione Ueagle 2
    Erro De Compilacao 2 Do Ueagle
    Blad Kompilacji Ueagle 2
    Ueagle Compileerfout 2
    Ueagle Kompileringsfel 2
    Ueagle Kompilierungsfehler 2

    Tags: No tags