ueagle-compile-error-2

Behebung Des Sammlungsfehlers 2 Ueagle

Hoffentlich hilft Ihnen diese Broschüre, wenn Sie einen Kompilierungsfehler für Ueagle 2 erfahren.

Aktualisiert: Restoro

  • 1. Laden Sie Restoro herunter und installieren Sie es
  • 2. Starten Sie das Programm und wählen Sie Ihre Sprache aus
  • 3. Befolgen Sie die Anweisungen auf dem Bildschirm, um mit der Suche nach Problemen zu beginnen
  • Verbessern Sie die Leistung Ihres Computers, indem Sie hier klicken, um die Software herunterzuladen.

    Aktualisiert: Restoro

    Läuft Ihr Computer langsam? Wird es von frustrierenden Fehlern und Problemen geplagt? Dann brauchen Sie Restoro – die ultimative Software zum Reparieren und Optimieren Ihres Windows-PCs. Mit Restoro können Sie jedes Windows-Problem mit nur wenigen Klicks beheben – einschließlich des gefürchteten Blue Screen of Death. Außerdem erkennt und behebt die Software Dateien und Anwendungen, die häufig abstürzen, sodass Sie so schnell wie möglich wieder an die Arbeit gehen können. Lassen Sie sich nicht von Ihrem Computer aufhalten – laden Sie Restoro noch heute herunter!


    Diese Tians benötigen einen ESP8266, also schauen Sie im SDK im offiziellen Blog nach, um es auszuprobieren. Diese Entwickler-Community hat den halben Tag damit verbracht, unsere eigene Online-Hilfe zum Kompilieren von Dokumenten zu erstellen, die in einem SDK geschrieben wurden. Fehler beim Sammeln von Hinweisen, Hinweise benötigen dies

    Ich habe sehr lange gesucht und festgestellt, dass eine Firma behauptet hat, dass das Makefile im gesamten Stammverzeichnis des SDK enthalten ist. dreiundzwanzigstes Ruderboot? = Nichts hat sich geändert, um Ihnen mit der neuen Software-App zu helfen? = 0 in SPI_SIZE_MAP geändert? zuerst = 0 normalaber ersetzt durch einige wie unten beschrieben

    Nach dem Beenden wurde es wieder komprimiert. Aber Sie stellen fest, dass er nicht zuverlässig sein kann. Dieser Download hat unseren Bedarf an der Funktionalität geändert. Da ich schon lange online bin, habe ich mit Sicherheit festgestellt, dass es Laufgolfschuhe gibt, die ein Upgrade auf die Begründung unterstützen, aber nicht von der sehr erweiterten Cloud unterstützt werden. Dann habe ich verglichen, ich würde sagen, dass der Platzbedarf zum Finden des Bootvorgangs gering ist, mehrere viel Platz lassen können und es ohne BIN-Datei ohne Funktion wäre. Das sind ungefähr 40K. Was ist, wenn Sie vielleicht nicht booten möchten, Sie nicht verlangen, Ihr Makefile zu ändern, vielleicht rausschmeißen? = Nein, App? = 3. Es wird jedoch als solches kompiliert und angezeigt.

    Warum erhalte ich die Fehlermeldung “Fehler beim Kompilieren einer Wertedatei”?

    Der Fehler “Fehler beim Zusammenstellen großer Wertedatei” wird durch einen Fehler eingeleitet, der normalerweise etwas mit dem Typ zusammen mit dem Wertedateieintrag angezeigt hat, den Sie haben. Wenn Sie beispielsweise mehr als eine Minute zu Get value eine Zahl hinzufügen, wird das lol-Zeichen ohne den richtigen Zeitstempel bereitgestellt.

    Und wenn von diesem Problem schließlich viele zusammen mit uns mir erlaubt haben, ein allgemeines Problem zu finden, kompilieren Sie auf jeden Fall die generierte Indikatordatei Eagle.irom0Text.Size trash 352kb, im Gegensatz zu iROM0_0SEG ist LEN 0x3C000 in Eagle.app.v6.LD , also nur 240K. Wie im Folgenden gezeigt

    Wie behebe ich einen Kompilierungsfehler – Nebenjob oder Beschäftigung nicht definiert?

    So beheben Sie Erfassungsfehler: Helfer oder undefinierte Funktion zwei Problem 1: Tippfehler 2 Paarfehler: Arbeitsblattfunktionen 3 Problem 3: Fehlende Operationstechnik 4 Problem 4: Unzugängliche Prozeduren unterschiedlich Problem 5: Deklarieren Sie eine Prozedur genau, die nicht in der Spezifikation ist definitiv DLL 6 Ausgabe 6: Vergessen Sie, wann Sie es schreiben müssen 7 Lebensläufe

    Einige LD-Personendatensätze reserviert eagle.app.v6.ld, in die die LD-Datei im Inneren von Len geändert wurde, dieses spezielle System = 0x59000 war erfolgreich als unter.

    GutVor dem Kompilieren. Dieses Problem hat die perfekte lange Zeit gedauert, weil ich mich damit nicht auskenne. Wenn Sie den gleichen Umstand haben, werden Neulinge hoffentlich zahlreiche Problemumgehungen durchführen.

     19:29:03 **** Inkrementelle Erhöhung unter Verwendung des Konfigurationsstandards für das Projekt ESP8266_NONOS_SDK ****alles machenmake [1]: Liste eingeben '/ cygdrive / i / BaiduYunDownload / esp8266 / esp8266 sdk ESP8266_NONOS_SDK / app'make [2]: Verzeichnis eingeben ist wichtig '/ cygdrive / i / BaiduYunDownload / esp8266 / esp8266 sdk für jeden ESP8266_NONOS_SDK / app / user'make [2]: Verzeichnis erstellen '/cygdrive / my friends and i / BaiduYunDownload / esp8266 and esp8266 sdk / ESP8266_NONOS_SDK / app and user'xt-xcc -L ../ lib -nostdlib -T ../ ld / eagle.app.v6.ld -Wl, - no-check-section -u call_user_start -Wl, -static -Wl, - start- group - lc -lgcc -lhal -lpp -lphy -lnet80211 -llwip -lwpa -lcrypto -lmain -ljson -lupgrade -lssl -lwps -lsmartconfig -lairkiss user / .output versus eagle / debug / lib und liuser. new -lat -Wl, - Gruppe überleben -o .output / eagle debug / image / eagle.app.v6.out/opt/xtensa-lx106-elf/bin/../lib/gcc/xtensa-lx106-elf/4.8.2/../../../../xtensa-lx106-elf/bin/ld: .end product / eagle / debug / photograph / eagle.app.v6.out Ein Teil der meisten `.irom0.Will 'Texte passt nicht in die gesamte innere Zone von` irom0_0_seg'Collect2: Fehler: ld hat den Exit-Status von Trick 1 zurückgegeben../Makefile:363: Fehler beim Ausführen des Rezepts von Betreff .output / eagle / debug per image / eagle.app.v6.outmake [1]: *** [.output or eagle / debug / star / eagle.app.v6.out] Fehler 1make [1]: Strategieverzeichnis Sdk / ESP8266_NONOS_SDK / Software-App beenden 'Makefile: 308: '/ cygdrive für jedes i/ baiduyundownload / esp8266 / esp8266 Rezept für bestimmte '.subdirs' fehlgeschlagenmake: *** [.subdirs] Aufsicht 2Do it all endet mit Ausgang 2, Standard. Die Zusammenstellung kann kaum vollständig sein. 

    Ich verwende ESP8266. Sie können ein inoffizielles Entwicklerkit erstellen, wenn es um Espressif geht, vor # 2 Tagen wurden alle Teile sicher kompiliert, aber in diesem Moment tritt dieser Fehler auf.

    ueagle Gather error 2

    Nächste Schritte, ich führe console.cmd aus und führe Renderanweisungen aus, Firmware wurde 2 Tage zuvor erfolgreich generiert, jetzt tritt ein Fehler auf:

      - echoTitel Firmware Nodemcu . erstellenESP8266SDK SET = C:  Espressif nPATH =% ESP8266SDK% xtensa-lx106-elf  bin; C: MinGWbin; C:  MinGW  msys  1.0  bin;% PATH%% Komspec% 
      xtensa-lx106-elf-gcc -L ../lib -Wl, -gc-section -Map = mapfile -xlinker -nostdlib -T ..- ld / eagle.app.v6.ld -u -wl, - no-check-section call_user_start -Wl, -static-Wl, - Fokus auf die Gruppe -lc -lgcc -lhal -lphy -lpp -lnet80211 -lwpa -lmain -ljson -lsmartconfig -lssl user / .output / large eagle / debug / lib oder libuser.a driver / .output / eagle oder debug / lib / libdriver.a lwip per .output / eagle für jedes Debug / lib / liblwip.a json für jedes .output / eagle / debug und lib / libjson.a upgrade / .result / eagle / debug lib / libupgrade.a platform / .output und eagle / debug / lib oder libplatform.a libc / .output / großer Adler / debug / lib - liblibc.a lua / .output / eagle für jeden debug / lib / liblua.a coap oder .output / eagle versus debug / lib / coap.a mqtt für jeden .output / eagle / debug für jede lib / mqtt.a u8glib / .product / eagle / debug für jede lib / u8glib.a smart / .output und eagle / debug / lib - smart.a wofs / .output / neuheitshelm / debug / lib für jede wofs.a spiffs / .output / eagle und debug / lib/spiffs.a cjson / .results / eagle / debug und lib / libcjson.a modules / .output versus eagle / debug / lib oder libmodules.a -Wl, - letzte Familieneinheit -. I. m -o .output / Neuheit Helm / Debug / Image per eagle.app.v6. oderTc: / espressif / xtensa-lx106-elf pro bin /../ lib / gcc pro xtensa-lx106-elf / 4.8.2 /../../../../xtensa-lx106-elf / farm / ld.exe: Abschnitt .output / large eagle / debug / image per eagle.app.v6.out`. Text 'passt nicht immer basierend auf der Fläche' iram1_0_seg 'collect2.exe: ld error: ein einzelner Ausgabestatus hat sich verringertmake [1]: *** [.output / eagle - debug / image / eagle.app.v6.out] Fehler 1make [1]: Verlasse das Verzeichnis `/b/Neo/Project/ESP8266/Project/nodemcu-firmware/easy‘tun: [***. Unterverzeichnisse] Fehler 2 

    ueagle Kompilierungsfehler 2

    Ungefähr 4-5 Personen Ich habe Probleme damit, Eagle auf diesem Computer richtig zum Laufen zu bringen.

    Meine üblichen Ideen sind sicherzustellen, dass Sie LIBEAY32.dll / IG4ICD64.dll umbenennen, OpenGL Upgrade Bat ausführen, den gfx-Treiber deinstallieren und vieles mehr. und alle Eagle-Tipps bereinigen, dann neu installieren, natürlich habe ich getestet, um alle VS++ zu aktualisieren, auch .Net usw. Als großen letzten Ausweg habe ich positiv auf Windows 10 aktualisiert. Es stellte sich heraus, dass das nicht viel riet entweder. Ich habe versucht, mein Fusion360 mit Hobby (Lizenz veraltet) neu zu installieren, angeblich könnte man damit etwas anfangen.

    Nach unzähligen Versuchen bestand mein Problem darin, alles aus dem TF-Speicher-Cache-Ordner zu löschen:

    Ich hoffe, dies hilft Ihnen weiter. Autodesk – Über die benötigten Lizenzen würde ich mich als kostenlose Belohnung freuen 🠙 ‚

    Verbessern Sie die Leistung Ihres Computers, indem Sie hier klicken, um die Software herunterzuladen.

    Ueagle Compile Error 2
    Error De Compilacion 2 De Ueagle
    Erreur De Compilation Ueagle 2
    Oshibka Kompilyacii Ueagle 2
    Errore Di Compilazione Ueagle 2
    Erro De Compilacao 2 Do Ueagle
    Blad Kompilacji Ueagle 2
    Ueagle Compileerfout 2
    Ueagle Kompileringsfel 2
    Ueagle 컴파일 오류 2

    Tags: No tags